# Android Build/Preview problem on Windows 10

**URL:** <https://forums.fusetools.com/t/android-build-preview-problem-on-windows-10/2457>\
**Category:** Bug Reports\
**Created:** [June 30, 2016, 9:34am UTC](https://forums.fusetools.com/t/android-build-preview-problem-on-windows-10/2457 "2016-06-30T09:34:07Z")\
**Posts on this page:** 4\
**Page:** 1

<div class="post-metadata">

**Author:** ![Francisco](https://avatars.discourse-cdn.com/v4/letter/f/eb9ed0/32.png) [@Francisco](https://forums.fusetools.com/u/Francisco)\
**Post date:** [June 30, 2016, 9:34am UTC](https://forums.fusetools.com/t/android-build-preview-problem-on-windows-10/2457/1 "2016-06-30T09:34:07Z")

</div>

Hi Fuse team.-

First, congrats for your great work!

I have two things to report:

1. “fuse install android” generate an error unziping the NDK file (Show error: Corrupt zip or disk full), so I installed manually the NDK (android-ndk-r10e) and everything is ok with installation, but…

2. When I try to preview on Android get that:

```auto
Fuse 0.21.0 (build 6650)
Build started: FullCompile
Configuring (6.29s)
Compiling syntax tree (10.00s)
Generating code and data (20.21s)
Building Android app
1/2: libAppName.so
arm-linux-androideabi-g++: error: USER/AppData/Local/Fusetools/Fuse/Android/android-ndk-r10e/sources/cxx-stl/stlport/stlport: No such file or directory
arm-linux-androideabi-g++: error: USER/AppData/Local/Fusetools/Fuse/Android/android-ndk-r10e/sources/cxx-stl/stlport/stlport: No such file or directory
arm-linux-androideabi-g++: error: USER/AppData/Local/Fusetools/Fuse/Android/android-ndk-r10e/sources/cxx-stl/stlport/stlport: No such file or directory
make: *** [.uno/_root.MainView.cpp.o] Error 1
make: *** Waiting for unfinished jobs....
make: *** [.uno/_root.g.cpp.o] Error 1
arm-linux-androideabi-g++: error: USER/AppData/Local/Fusetools/Fuse/Android/android-ndk-r10e/sources/cxx-stl/stlport/stlport: No such file or directory
make: *** [.uno/Android.android.app.g.cpp.o] Error 1
make: *** [.uno/Android.android.content.g.cpp.o] Error 1
_root.g.cpp
_root.MainView.cpp
Android.android.app.g.cpp
Android.android.content.g.cpp
(unknown): E0200: Android build failed
?: Error E0200: Android build failed
(0.56s)

Build completed in 37.07 seconds
1 error

```

Show this (arm-linux-androideabi-g++) error 4 or 5 times and results E0200: Android build failed.

Fuse version: 0.21.0

Operating System: Windows 10 Pro (64-Bits)

Thank you.

---

<div class="post-metadata">

**Author:** ![Emil\_Sandsto](https://yyz1.discourse-cdn.com/flex035/user_avatar/forums.fusetools.com/emil_sandsto/32/523_2.png) [@Emil\_Sandsto](https://forums.fusetools.com/u/Emil_Sandsto)\
**Post date:** [June 30, 2016, 1:08pm UTC](https://forums.fusetools.com/t/android-build-preview-problem-on-windows-10/2457/2 "2016-06-30T13:08:06Z")

</div>

Hi Francisco,

Is this path valid `%localappdata%/Fusetools/Fuse/Android/android-ndk-r10e/sources/cxx-stl/stlport/stlport`?

Also do you have a space in your user name?

---

<div class="post-metadata">

**Author:** ![Francisco](https://avatars.discourse-cdn.com/v4/letter/f/eb9ed0/32.png) [@Francisco](https://forums.fusetools.com/u/Francisco)\
**Post date:** [July 1, 2016, 9:27am UTC](https://forums.fusetools.com/t/android-build-preview-problem-on-windows-10/2457/3 "2016-07-01T09:27:37Z")

</div>

Hi Emil.-

Yes, the path is valid and I have +100GB of free space.

Any suggestion?

Thanks!

---

<div class="post-metadata">

**Author:** ![Emil\_Sandsto](https://yyz1.discourse-cdn.com/flex035/user_avatar/forums.fusetools.com/emil_sandsto/32/523_2.png) [@Emil\_Sandsto](https://forums.fusetools.com/u/Emil_Sandsto)\
**Post date:** [July 8, 2016, 2:12pm UTC](https://forums.fusetools.com/t/android-build-preview-problem-on-windows-10/2457/4 "2016-07-08T14:12:15Z")

</div>

I am sorry, I wasn’t very precise here. Do your username contain spaces, such as `Francisco Lastname` for example? Or any special characters?
